Reaction Details
TargetSteroid hormone receptor ERR1
LigandBDBM50336749
Substrate/Competitorn/a
Meas. Tech.ChEMBL_718350 (CHEMBL1679770)
IC50 470±n/a nM
Citation Patch, RJSearle, LLKim, AJDe, DZhu, XAskari, HBO'Neill, JCAbad, MCRentzeperis, DLiu, JKemmerer, MLin, LKasturi, JGeisler, JGLenhard, JMPlayer, MRGaul, MD Identification of diaryl ether-based ligands for estrogen-related receptora as potential antidiabetic agents. J Med Chem54:788-808 (2012) 
 
Steroid hormone receptor ERR1
Name:Steroid hormone receptor ERR1
Type:PROTEIN
Mol. Mass.:45508.08
Organism:Homo sapiens (Human)
Description:ChEMBL_1499891
Residue:423
BDBM50336749
NameBDBM50336749
Synonyms:4-[4-(2,4-Dioxothiazolidin-5-ylidenemethyl)-2-methoxyphenoxy]-3-nitrobenzoic Acid Methyl Ester | CHEMBL1671957
TypeSmall organic molecule
Emp. Form.C19H14N2O8S
Mol. Mass.430.388
SMILESCOC(=O)c1ccc(Oc2ccc(C=C3SC(O)=NC3=O)cc2OC)c(c1)[N+]([O-])=O