Reaction Details
TargetSteroid hormone receptor ERR1
LigandBDBM50336766
Substrate/Competitorn/a
Meas. Tech.ChEMBL_718350 (CHEMBL1679770)
IC50 500±n/a nM
Citation Patch, RJSearle, LLKim, AJDe, DZhu, XAskari, HBO'Neill, JCAbad, MCRentzeperis, DLiu, JKemmerer, MLin, LKasturi, JGeisler, JGLenhard, JMPlayer, MRGaul, MD Identification of diaryl ether-based ligands for estrogen-related receptora as potential antidiabetic agents. J Med Chem54:788-808 (2012) 
 
Steroid hormone receptor ERR1
Name:Steroid hormone receptor ERR1
Type:PROTEIN
Mol. Mass.:45508.08
Organism:Homo sapiens (Human)
Description:ChEMBL_1499891
Residue:423
BDBM50336766
NameBDBM50336766
Synonyms:4-[4-(2,4-Dioxothiazolidin-5-ylidenemethyl)-2-methoxyphenoxy]-isophthalonitrile | CHEMBL1671962
TypeSmall organic molecule
Emp. Form.C19H11N3O4S
Mol. Mass.377.373
SMILESCOc1cc(C=C2SC(O)=NC2=O)ccc1Oc1ccc(cc1C#N)C#N