Reaction Details
TargetSteroid hormone receptor ERR1
LigandBDBM50336754
Substrate/Competitorn/a
Meas. Tech.ChEMBL_718350 (CHEMBL1679770)
IC50 165±n/a nM
Citation Patch, RJSearle, LLKim, AJDe, DZhu, XAskari, HBO'Neill, JCAbad, MCRentzeperis, DLiu, JKemmerer, MLin, LKasturi, JGeisler, JGLenhard, JMPlayer, MRGaul, MD Identification of diaryl ether-based ligands for estrogen-related receptora as potential antidiabetic agents. J Med Chem54:788-808 (2012) 
 
Steroid hormone receptor ERR1
Name:Steroid hormone receptor ERR1
Type:PROTEIN
Mol. Mass.:45508.08
Organism:Homo sapiens (Human)
Description:ChEMBL_1499891
Residue:423
BDBM50336754
NameBDBM50336754
Synonyms:5-[4-(2-Chloro-4-trifluoromethylphenoxy)-3-methoxybenzylidene]thiazolidine-2,4-dione | CHEMBL1671965
TypeSmall organic molecule
Emp. Form.C18H11ClF3NO4S
Mol. Mass.429.797
SMILESCOc1cc(C=C2SC(O)=NC2=O)ccc1Oc1ccc(cc1Cl)C(F)(F)F