Reaction Details
TargetCytochrome P450 2D6
LigandBDBM50336757
Substrate/Competitorn/a
Meas. Tech.ChEMBL_718342 (CHEMBL1679762)
IC50>10000±n/a nM
Citation Patch, RJSearle, LLKim, AJDe, DZhu, XAskari, HBO'Neill, JCAbad, MCRentzeperis, DLiu, JKemmerer, MLin, LKasturi, JGeisler, JGLenhard, JMPlayer, MRGaul, MD Identification of diaryl ether-based ligands for estrogen-related receptora as potential antidiabetic agents. J Med Chem54:788-808 (2012) 
 
Cytochrome P450 2D6
Name:Cytochrome P450 2D6
Type:Protein
Mol. Mass.:55774.82
Organism:Homo sapiens (Human)
Description:P10635
Residue:497
BDBM50336757
NameBDBM50336757
Synonyms:5-[4-(2-Bromo-4-trifluoromethylphenoxy)-3-methoxybenzylidene]thiazolidine-2,4-dione | CHEMBL1671967
TypeSmall organic molecule
Emp. Form.C18H11BrF3NO4S
Mol. Mass.474.248
SMILESCOc1cc(C=C2SC(O)=NC2=O)ccc1Oc1ccc(cc1Br)C(F)(F)F