Reaction Details
TargetCytochrome P450 2D6
LigandBDBM50336738
Substrate/Competitorn/a
Meas. Tech.ChEMBL_718342 (CHEMBL1679762)
IC50>10000±n/a nM
Citation Patch, RJSearle, LLKim, AJDe, DZhu, XAskari, HBO'Neill, JCAbad, MCRentzeperis, DLiu, JKemmerer, MLin, LKasturi, JGeisler, JGLenhard, JMPlayer, MRGaul, MD Identification of diaryl ether-based ligands for estrogen-related receptora as potential antidiabetic agents. J Med Chem54:788-808 (2012) 
 
Cytochrome P450 2D6
Name:Cytochrome P450 2D6
Type:Protein
Mol. Mass.:55774.82
Organism:Homo sapiens (Human)
Description:P10635
Residue:497
BDBM50336738
NameBDBM50336738
Synonyms:4-[4-(2,4-Dioxothiazolidin-5-ylidenemethyl)-2-methoxyphenoxy]-naphthalene-1-carbonitrile | CHEMBL1671981
TypeSmall organic molecule
Emp. Form.C22H14N2O4S
Mol. Mass.402.423
SMILESCOc1cc(C=C2SC(O)=NC2=O)ccc1Oc1ccc(C#N)c2ccccc12