Reaction Details
TargetCytochrome P450 3A4
LigandBDBM50336761
Substrate/Competitorn/a
Meas. Tech.ChEMBL_718343 (CHEMBL1679763)
IC50 1900±n/a nM
Citation Patch, RJSearle, LLKim, AJDe, DZhu, XAskari, HBO'Neill, JCAbad, MCRentzeperis, DLiu, JKemmerer, MLin, LKasturi, JGeisler, JGLenhard, JMPlayer, MRGaul, MD Identification of diaryl ether-based ligands for estrogen-related receptora as potential antidiabetic agents. J Med Chem54:788-808 (2012) 
 
Cytochrome P450 3A4
Name:Cytochrome P450 3A4
Type:Enzyme
Mol. Mass.:57349.57
Organism:Homo sapiens (Human)
Description:n/a
Residue:503
BDBM50336761
NameBDBM50336761
Synonyms:5-[4-(2-Trifluoromethylphenoxy)-3-methoxybenzylidene]-thiazolidine-2,4-dione | CHEMBL1671972
TypeSmall organic molecule
Emp. Form.C18H12F3NO4S
Mol. Mass.395.352
SMILESCOc1cc(C=C2SC(O)=NC2=O)ccc1Oc1ccccc1C(F)(F)F