Reaction Details
TargetIsoform 1 of Steroid hormone receptor ERR2 (ERRbeta2-delta10)
LigandBDBM17292
Substrate/Competitorn/a
Meas. Tech.ChEMBL_718352 (CHEMBL1679772)
EC50 4.6±n/a nM
Citation Patch, RJSearle, LLKim, AJDe, DZhu, XAskari, HBO'Neill, JCAbad, MCRentzeperis, DLiu, JKemmerer, MLin, LKasturi, JGeisler, JGLenhard, JMPlayer, MRGaul, MD Identification of diaryl ether-based ligands for estrogen-related receptora as potential antidiabetic agents. J Med Chem54:788-808 (2012) 
 
Isoform 1 of Steroid hormone receptor ERR2 (ERRbeta2-delta10)
Name:Isoform 1 of Steroid hormone receptor ERR2 (ERRbeta2-delta10)
Type:PROTEIN
Mol. Mass.:56220.72
Organism:Homo sapiens (Human)
Description:ChEMBL_940755
Residue:508
BDBM17292
NameBDBM17292
Synonyms:(1S,10R,11S,14S,15S)-15-methyltetracyclo[8.7.0.0^{2,7}.0^{11,15}]heptadeca-2,4,6-triene-5,14-diol 17α-ethinylestradiol CHEMBL135 ESTRADIOL Ovocyclin US9040509, E2 US9561238, E2 [2,4,6,7-3H]-E2 [3H]]estradiol
TypeSteroid
Emp. Form.C18H24O2
Mol. Mass.272.382
SMILES[H][C@@]12CC[C@H](O)[C@@]1(C)CC[C@]1([H])c3ccc(O)cc3CC[C@@]21[H]