Reaction Details
TargetEstrogen receptor
LigandBDBM50336730
Substrate/Competitorn/a
Meas. Tech.ChEMBL_718358 (CHEMBL1679778)
IC50>6300±n/a nM
Citation Patch, RJSearle, LLKim, AJDe, DZhu, XAskari, HBO'Neill, JCAbad, MCRentzeperis, DLiu, JKemmerer, MLin, LKasturi, JGeisler, JGLenhard, JMPlayer, MRGaul, MD Identification of diaryl ether-based ligands for estrogen-related receptora as potential antidiabetic agents. J Med Chem54:788-808 (2012) 
 
Estrogen receptor
Name:Estrogen receptor
Type:Protein
Mol. Mass.:66230.44
Organism:Homo sapiens (Human)
Description:P03372
Residue:595
BDBM50336730
NameBDBM50336730
Synonyms:4-[4-(2,4-Dioxothiazolidin-5-ylidenemethyl)-2-methoxyphenoxy]-3-trifluoromethylbenzonitrile | CHEMBL1671971
TypeSmall organic molecule
Emp. Form.C19H11F3N2O4S
Mol. Mass.420.362
SMILESCOc1cc(C=C2SC(O)=NC2=O)ccc1Oc1ccc(cc1C(F)(F)F)C#N