Reaction Details
TargetPeroxisome proliferator-activated receptor alpha
LigandBDBM50099491
Substrate/Competitorn/a
Meas. Tech.ChEMBL_718366 (CHEMBL1679786)
EC50 400±n/a nM
Citation Patch, RJSearle, LLKim, AJDe, DZhu, XAskari, HBO'Neill, JCAbad, MCRentzeperis, DLiu, JKemmerer, MLin, LKasturi, JGeisler, JGLenhard, JMPlayer, MRGaul, MD Identification of diaryl ether-based ligands for estrogen-related receptora as potential antidiabetic agents. J Med Chem54:788-808 (2012) 
 
Peroxisome proliferator-activated receptor alpha
Name:Peroxisome proliferator-activated receptor alpha
Type:Enzyme
Mol. Mass.:52222.08
Organism:Homo sapiens (Human)
Description:Q07869
Residue:468
BDBM50099491
NameBDBM50099491
Synonyms:2-(4-(2-(3-cyclohexyl-1-(4-cyclohexylbutyl)ureido)ethyl)phenylthio)-2-methylpropanoic acid CHEMBL21241 cid_3392731
TypeSmall organic molecule
Emp. Form.C29H46N2O3S
Mol. Mass.502.752
SMILESCC(C)(Sc1ccc(CCN(CCCCC2CCCCC2)C(=O)NC2CCCCC2)cc1)C(O)=O