Reaction Details
TargetPeroxisome proliferator-activated receptor alpha
LigandBDBM50336730
Substrate/Competitorn/a
Meas. Tech.ChEMBL_718366 (CHEMBL1679786)
IC50>15000±n/a nM
Citation Patch, RJSearle, LLKim, AJDe, DZhu, XAskari, HBO'Neill, JCAbad, MCRentzeperis, DLiu, JKemmerer, MLin, LKasturi, JGeisler, JGLenhard, JMPlayer, MRGaul, MD Identification of diaryl ether-based ligands for estrogen-related receptora as potential antidiabetic agents. J Med Chem54:788-808 (2012) 
 
Peroxisome proliferator-activated receptor alpha
Name:Peroxisome proliferator-activated receptor alpha
Type:Enzyme
Mol. Mass.:52222.08
Organism:Homo sapiens (Human)
Description:Q07869
Residue:468
BDBM50336730
NameBDBM50336730
Synonyms:4-[4-(2,4-Dioxothiazolidin-5-ylidenemethyl)-2-methoxyphenoxy]-3-trifluoromethylbenzonitrile | CHEMBL1671971
TypeSmall organic molecule
Emp. Form.C19H11F3N2O4S
Mol. Mass.420.362
SMILESCOc1cc(C=C2SC(O)=NC2=O)ccc1Oc1ccc(cc1C(F)(F)F)C#N