Reaction Details
TargetSteroid hormone receptor ERR1
LigandBDBM50336745
Substrate/Competitorn/a
Meas. Tech.ChEMBL_718350 (CHEMBL1679770)
IC50 1800±n/a nM
Citation Patch, RJSearle, LLKim, AJDe, DZhu, XAskari, HBO'Neill, JCAbad, MCRentzeperis, DLiu, JKemmerer, MLin, LKasturi, JGeisler, JGLenhard, JMPlayer, MRGaul, MD Identification of diaryl ether-based ligands for estrogen-related receptora as potential antidiabetic agents. J Med Chem54:788-808 (2012) 
 
Steroid hormone receptor ERR1
Name:Steroid hormone receptor ERR1
Type:PROTEIN
Mol. Mass.:45508.08
Organism:Homo sapiens (Human)
Description:ChEMBL_1499891
Residue:423
BDBM50336745
NameBDBM50336745
Synonyms:4-[4-(2,4-Dioxothiazolidin-5-ylidenemethyl)-2,6-dimethoxyphenoxy]-2-trifluoromethylbenzonitrile | CHEMBL1671988
TypeSmall organic molecule
Emp. Form.C20H13F3N2O5S
Mol. Mass.450.388
SMILESCOc1cc(C=C2SC(O)=NC2=O)cc(OC)c1Oc1ccc(C#N)c(c1)C(F)(F)F