Reaction Details
TargetSteroid hormone receptor ERR1
LigandBDBM50336736
Substrate/Competitorn/a
Meas. Tech.ChEMBL_718350 (CHEMBL1679770)
IC50 1300±n/a nM
Citation Patch, RJSearle, LLKim, AJDe, DZhu, XAskari, HBO'Neill, JCAbad, MCRentzeperis, DLiu, JKemmerer, MLin, LKasturi, JGeisler, JGLenhard, JMPlayer, MRGaul, MD Identification of diaryl ether-based ligands for estrogen-related receptora as potential antidiabetic agents. J Med Chem54:788-808 (2012) 
 
Steroid hormone receptor ERR1
Name:Steroid hormone receptor ERR1
Type:PROTEIN
Mol. Mass.:45508.08
Organism:Homo sapiens (Human)
Description:ChEMBL_1499891
Residue:423
BDBM50336736
NameBDBM50336736
Synonyms:2-Chloro-4-[4-(2,4-dioxothiazolidin-5-ylidenemethyl)-2-methoxyphenoxy]benzonitrile | CHEMBL1671979
TypeSmall organic molecule
Emp. Form.C18H11ClN2O4S
Mol. Mass.386.809
SMILESCOc1cc(C=C2SC(O)=NC2=O)ccc1Oc1ccc(C#N)c(Cl)c1