Reaction Details
TargetP2Y purinoceptor 2
LigandBDBM50268874
Substrate/Competitorn/a
Meas. Tech.ChEMBL_718668 (CHEMBL1680819)
IC50 3270±n/a nM
Citation Baqi, YHausmann, RRosefort, CRettinger, JSchmalzing, GMüller, CE Discovery of potent competitive antagonists and positive modulators of the P2X2 receptor. J Med Chem54:817-30 (2012) 
 
P2Y purinoceptor 2
Name:P2Y purinoceptor 2
Type:PROTEIN
Mol. Mass.:42299.21
Organism:Homo sapiens (Human)
Description:ChEMBL_1455361
Residue:377
BDBM50268874
NameBDBM50268874
Synonyms:CHEMBL499580 | Sodium 1-Amino-4-[3-(4,6-dichloro-[1,3,5]triazine-2-ylamino)-5-carboxyphenylamino]-9,10-dioxo-9,10-dihydroanthracene-2-sulfonate
TypeSmall organic molecule
Emp. Form.C24H13Cl2N6O7S
Mol. Mass.600.368
SMILESNc1c(cc(Nc2cc(Nc3nc(Cl)nc(Cl)n3)cc(c2)C(O)=O)c2C(=O)c3ccccc3C(=O)c12)S([O-])(=O)=O