Reaction Details
TargetP2Y purinoceptor 6
LigandBDBM50268725
Substrate/Competitorn/a
Meas. Tech.ChEMBL_718670 (CHEMBL1680821)
IC50 5300±n/a nM
Citation Baqi, YHausmann, RRosefort, CRettinger, JSchmalzing, GMüller, CE Discovery of potent competitive antagonists and positive modulators of the P2X2 receptor. J Med Chem54:817-30 (2012) 
 
P2Y purinoceptor 6
Name:P2Y purinoceptor 6
Type:PROTEIN
Mol. Mass.:36452.29
Organism:Homo sapiens (Human)
Description:ChEMBL_1511151
Residue:328
BDBM50268725
NameBDBM50268725
Synonyms:CHEMBL496030 | sodium 1-amino-4-(4-hydroxyphenylamino)-9,10-dioxo-9,10-dihydroanthracene-2-sulfonate
TypeSmall organic molecule
Emp. Form.C20H13N2O6S
Mol. Mass.409.393
SMILESNc1c(cc(Nc2ccc(O)cc2)c2C(=O)c3ccccc3C(=O)c12)S([O-])(=O)=O