Reaction Details
TargetP2Y purinoceptor 6
LigandBDBM50227020
Substrate/Competitorn/a
Meas. Tech.ChEMBL_718670 (CHEMBL1680821)
IC50>10000±n/a nM
Citation Baqi, YHausmann, RRosefort, CRettinger, JSchmalzing, GMüller, CE Discovery of potent competitive antagonists and positive modulators of the P2X2 receptor. J Med Chem54:817-30 (2012) 
 
P2Y purinoceptor 6
Name:P2Y purinoceptor 6
Type:PROTEIN
Mol. Mass.:36452.29
Organism:Homo sapiens (Human)
Description:ChEMBL_1511151
Residue:328
BDBM50227020
NameBDBM50227020
Synonyms:CHEMBL271672 | sodium 1-amino-4-(3-chlorophenylamino)-9,10-dioxo-9,10-dihydroanthracene-2-sulfonate
TypeSmall organic molecule
Emp. Form.C20H12ClN2O5S
Mol. Mass.427.838
SMILESNc1c(cc(Nc2cccc(Cl)c2)c2C(=O)c3ccccc3C(=O)c12)S([O-])(=O)=O