Reaction Details
TargetP2Y purinoceptor 6
LigandBDBM50336781
Substrate/Competitorn/a
Meas. Tech.ChEMBL_718670 (CHEMBL1680821)
IC50>10000±n/a nM
Citation Baqi, YHausmann, RRosefort, CRettinger, JSchmalzing, GMüller, CE Discovery of potent competitive antagonists and positive modulators of the P2X2 receptor. J Med Chem54:817-30 (2012) 
 
P2Y purinoceptor 6
Name:P2Y purinoceptor 6
Type:PROTEIN
Mol. Mass.:36452.29
Organism:Homo sapiens (Human)
Description:ChEMBL_1511151
Residue:328
BDBM50336781
NameBDBM50336781
Synonyms:CHEMBL1672104 | Disodium 1-Amino-4-[3-(4,6-dichloro[1,3,5]triazine-2-ylamino)-4-sulfophenylamino]-9,10-dioxo-9,10-dihydroanthracene-2-sulfonate
TypeSmall organic molecule
Emp. Form.C23H12Cl2N6O8S2
Mol. Mass.635.414
SMILESNc1c(cc(Nc2ccc(c(Nc3nc(Cl)nc(Cl)n3)c2)S([O-])(=O)=O)c2C(=O)c3ccccc3C(=O)c12)S([O-])(=O)=O