Reaction Details
TargetP2X purinoceptor 2
LigandBDBM50336787
Substrate/Competitorn/a
Meas. Tech.ChEMBL_718656 (CHEMBL1680807)
IC50 800±n/a nM
Citation Baqi, YHausmann, RRosefort, CRettinger, JSchmalzing, GMüller, CE Discovery of potent competitive antagonists and positive modulators of the P2X2 receptor. J Med Chem54:817-30 (2012) 
 
P2X purinoceptor 2
Name:P2X purinoceptor 2
Type:Enzyme Catalytic Domain
Mol. Mass.:52625.55
Organism:RAT
Description:Purinergic, P2X2 0 RAT::P49653
Residue:472
BDBM50336787
NameBDBM50336787
Synonyms:CHEMBL445413 sodium 4-(m-toluidino)-1-amino-9,10-dioxo-9,10-dihydroanthracene-2-sulfonate
TypeSmall organic molecule
Emp. Form.C21H15N2O5S
Mol. Mass.407.42
SMILESCc1cccc(Nc2cc(c(N)c3C(=O)c4ccccc4C(=O)c23)S([O-])(=O)=O)c1