Reaction Details
TargetP2X purinoceptor 2
LigandBDBM50268686
Substrate/Competitorn/a
Meas. Tech.ChEMBL_718656 (CHEMBL1680807)
IC50 1000±n/a nM
Citation Baqi, YHausmann, RRosefort, CRettinger, JSchmalzing, GMüller, CE Discovery of potent competitive antagonists and positive modulators of the P2X2 receptor. J Med Chem54:817-30 (2012) 
 
P2X purinoceptor 2
Name:P2X purinoceptor 2
Type:Enzyme Catalytic Domain
Mol. Mass.:52625.55
Organism:RAT
Description:Purinergic, P2X2 0 RAT::P49653
Residue:472
BDBM50268686
NameBDBM50268686
Synonyms:CHEMBL496022 sodium 1-amino-9,10-dioxo-4-(4-sulfophenylamino)-9,10-dihydroanthracene-2-sulfonate
TypeSmall organic molecule
Emp. Form.C20H12N2O8S2
Mol. Mass.472.449
SMILESNc1c2C(=O)c3ccccc3C(=O)c2c(Nc2ccc(cc2)S([O-])(=O)=O)cc1S([O-])(=O)=O