Reaction Details
TargetP2X purinoceptor 2
LigandBDBM50227015
Substrate/Competitorn/a
Meas. Tech.ChEMBL_718656 (CHEMBL1680807)
IC50 690±n/a nM
Citation Baqi, YHausmann, RRosefort, CRettinger, JSchmalzing, GMüller, CE Discovery of potent competitive antagonists and positive modulators of the P2X2 receptor. J Med Chem54:817-30 (2012) 
 
P2X purinoceptor 2
Name:P2X purinoceptor 2
Type:Enzyme Catalytic Domain
Mol. Mass.:52625.55
Organism:RAT
Description:Purinergic, P2X2 0 RAT::P49653
Residue:472
BDBM50227015
NameBDBM50227015
Synonyms:CHEMBL271688 sodium 4-(4-acetamidophenylamino)-1-amino-9,10-dioxo-9,10-dihydroanthracene-2-sulfonate
TypeSmall organic molecule
Emp. Form.C22H16N3O6S
Mol. Mass.450.444
SMILESCC(=O)Nc1ccc(Nc2cc(c(N)c3C(=O)c4ccccc4C(=O)c23)S([O-])(=O)=O)cc1