Reaction Details
TargetP2X purinoceptor 2
LigandBDBM50268966
Substrate/Competitorn/a
Meas. Tech.ChEMBL_718656 (CHEMBL1680807)
IC50>1000±n/a nM
Citation Baqi, YHausmann, RRosefort, CRettinger, JSchmalzing, GMüller, CE Discovery of potent competitive antagonists and positive modulators of the P2X2 receptor. J Med Chem54:817-30 (2012) 
 
P2X purinoceptor 2
Name:P2X purinoceptor 2
Type:Enzyme Catalytic Domain
Mol. Mass.:52625.55
Organism:RAT
Description:Purinergic, P2X2 0 RAT::P49653
Residue:472
BDBM50268966
NameBDBM50268966
Synonyms:CHEMBL496229 | Sodium 1-Amino-4-[4-([1,3]diazine-2-ylamino)phenylamino]-9,10-dioxo-9,10-dihydroanthracene-2-sulfonate
TypeSmall organic molecule
Emp. Form.C24H16N5O5S
Mol. Mass.486.48
SMILESNc1c(cc(Nc2ccc(Nc3ncccn3)cc2)c2C(=O)c3ccccc3C(=O)c12)S([O-])(=O)=O