Reaction Details
TargetP2X purinoceptor 2
LigandBDBM50262422
Substrate/Competitorn/a
Meas. Tech.ChEMBL_718656 (CHEMBL1680807)
IC50 4000±n/a nM
Citation Baqi, YHausmann, RRosefort, CRettinger, JSchmalzing, GMüller, CE Discovery of potent competitive antagonists and positive modulators of the P2X2 receptor. J Med Chem54:817-30 (2012) 
 
P2X purinoceptor 2
Name:P2X purinoceptor 2
Type:Enzyme Catalytic Domain
Mol. Mass.:52625.55
Organism:RAT
Description:Purinergic, P2X2 0 RAT::P49653
Residue:472
BDBM50262422
NameBDBM50262422
Synonyms:CHEMBL477339 | sodium (E)-4-((3-formyl-4-hydroxy-5-methyl-2-(phosphonatooxymethyl)phenyl)diazenyl)benzene-1,3-disulfonate
TypeSmall organic molecule
Emp. Form.C15H11N2O12PS2
Mol. Mass.506.36
SMILESCc1cc(N=Nc2ccc(cc2S([O-])(=O)=O)S([O-])(=O)=O)c(COP([O-])([O-])=O)c(C=O)c1O