Reaction Details
TargetP2X purinoceptor 4
LigandBDBM50227015
Substrate/Competitorn/a
Meas. Tech.ChEMBL_718658 (CHEMBL1680809)
IC50>10000±n/a nM
Citation Baqi, YHausmann, RRosefort, CRettinger, JSchmalzing, GMüller, CE Discovery of potent competitive antagonists and positive modulators of the P2X2 receptor. J Med Chem54:817-30 (2012) 
 
P2X purinoceptor 4
Name:P2X purinoceptor 4
Type:Enzyme Catalytic Domain
Mol. Mass.:43504.16
Organism:RAT
Description:Purinergic, P2X4 0 RAT::P51577
Residue:388
BDBM50227015
NameBDBM50227015
Synonyms:CHEMBL271688 sodium 4-(4-acetamidophenylamino)-1-amino-9,10-dioxo-9,10-dihydroanthracene-2-sulfonate
TypeSmall organic molecule
Emp. Form.C22H16N3O6S
Mol. Mass.450.444
SMILESCC(=O)Nc1ccc(Nc2cc(c(N)c3C(=O)c4ccccc4C(=O)c23)S([O-])(=O)=O)cc1