Reaction Details
TargetMetabotropic glutamate receptor 5
LigandBDBM50336834
Substrate/Competitorn/a
Meas. Tech.ChEMBL_718850 (CHEMBL1681232)
Ki 3.7±n/a nM
Citation Siméon, FGWendahl, MTPike, VW Syntheses of 2-amino and 2-halothiazole derivatives as high-affinity metabotropic glutamate receptor subtype 5 ligands and potential radioligands for in vivo imaging. J Med Chem54:901-8 (2012) 
 
Metabotropic glutamate receptor 5
Name:Metabotropic glutamate receptor 5
Type:Enzyme
Mol. Mass.:131900.14
Organism:Rattus norvegicus (Rat)
Description:P31424
Residue:1203
BDBM50336834
NameBDBM50336834
Synonyms:3-((2-bromothiazol-4-yl)ethynyl)benzonitrile | CHEMBL1672279
TypeSmall organic molecule
Emp. Form.C12H5BrN2S
Mol. Mass.289.151
SMILESBrc1nc(cs1)C#Cc1cccc(c1)C#N