Reaction Details
TargetMetabotropic glutamate receptor 5
LigandBDBM50336845
Substrate/Competitorn/a
Meas. Tech.ChEMBL_718850 (CHEMBL1681232)
Ki 23±n/a nM
Citation Siméon, FGWendahl, MTPike, VW Syntheses of 2-amino and 2-halothiazole derivatives as high-affinity metabotropic glutamate receptor subtype 5 ligands and potential radioligands for in vivo imaging. J Med Chem54:901-8 (2012) 
 
Metabotropic glutamate receptor 5
Name:Metabotropic glutamate receptor 5
Type:Enzyme
Mol. Mass.:131900.14
Organism:Rattus norvegicus (Rat)
Description:P31424
Residue:1203
BDBM50336845
NameBDBM50336845
Synonyms:2-Fluoro-4-((3-methoxyphenyl)ethynyl)thiazole | CHEMBL1671873
TypeSmall organic molecule
Emp. Form.C12H8FNOS
Mol. Mass.233.261
SMILESCOc1cccc(c1)C#Cc1csc(F)n1