Reaction Details
Target5-hydroxytryptamine receptor 1B
LigandBDBM50336843
Substrate/Competitorn/a
Meas. Tech.ChEMBL_718852 (CHEMBL1681234)
Ki>10000±n/a nM
Citation Siméon, FGWendahl, MTPike, VW Syntheses of 2-amino and 2-halothiazole derivatives as high-affinity metabotropic glutamate receptor subtype 5 ligands and potential radioligands for in vivo imaging. J Med Chem54:901-8 (2012) 
 
5-hydroxytryptamine receptor 1B
Name:5-hydroxytryptamine receptor 1B
Type:G Protein-Coupled Receptor (GPCR)
Mol. Mass.:43579.17
Organism:Homo sapiens (Human)
Description:Receptor binding assays were performed using human clone stably expressed in CHO cells
Residue:390
BDBM50336843
NameBDBM50336843
Synonyms:3-((2-Fluorothiazol-4-yl)ethynyl)-5-fluorobenzonitrile | CHEMBL1672288
TypeSmall organic molecule
Emp. Form.C12H4F2N2S
Mol. Mass.246.235
SMILESFc1nc(cs1)C#Cc1cc(F)cc(c1)C#N