Reaction Details
Target5-hydroxytryptamine receptor 3A
LigandBDBM50336843
Substrate/Competitorn/a
Meas. Tech.ChEMBL_718858 (CHEMBL1681240)
Ki>10000±n/a nM
Citation Siméon, FGWendahl, MTPike, VW Syntheses of 2-amino and 2-halothiazole derivatives as high-affinity metabotropic glutamate receptor subtype 5 ligands and potential radioligands for in vivo imaging. J Med Chem54:901-8 (2012) 
 
5-hydroxytryptamine receptor 3A
Name:5-hydroxytryptamine receptor 3A
Type:Protein
Mol. Mass.:55283.27
Organism:Homo sapiens (Human)
Description:P46098
Residue:478
BDBM50336843
NameBDBM50336843
Synonyms:3-((2-Fluorothiazol-4-yl)ethynyl)-5-fluorobenzonitrile | CHEMBL1672288
TypeSmall organic molecule
Emp. Form.C12H4F2N2S
Mol. Mass.246.235
SMILESFc1nc(cs1)C#Cc1cc(F)cc(c1)C#N