Reaction Details
TargetMetabotropic glutamate receptor 2
LigandBDBM50336843
Substrate/Competitorn/a
Meas. Tech.ChEMBL_718171 (CHEMBL1679217)
Ki>10000±n/a nM
Citation Siméon, FGWendahl, MTPike, VW Syntheses of 2-amino and 2-halothiazole derivatives as high-affinity metabotropic glutamate receptor subtype 5 ligands and potential radioligands for in vivo imaging. J Med Chem54:901-8 (2012) 
 
Metabotropic glutamate receptor 2
Name:Metabotropic glutamate receptor 2
Type:Enzyme
Mol. Mass.:95584.88
Organism:Homo sapiens (Human)
Description:Q14416
Residue:872
BDBM50336843
NameBDBM50336843
Synonyms:3-((2-Fluorothiazol-4-yl)ethynyl)-5-fluorobenzonitrile | CHEMBL1672288
TypeSmall organic molecule
Emp. Form.C12H4F2N2S
Mol. Mass.246.235
SMILESFc1nc(cs1)C#Cc1cc(F)cc(c1)C#N