Reaction Details
TargetSigma non-opioid intracellular receptor 1
LigandBDBM50336843
Substrate/Competitorn/a
Meas. Tech.ChEMBL_718179 (CHEMBL1679225)
Ki>10000±n/a nM
Citation Siméon, FGWendahl, MTPike, VW Syntheses of 2-amino and 2-halothiazole derivatives as high-affinity metabotropic glutamate receptor subtype 5 ligands and potential radioligands for in vivo imaging. J Med Chem54:901-8 (2012) 
 
Sigma non-opioid intracellular receptor 1
Name:Sigma non-opioid intracellular receptor 1
Type:Enzyme Catalytic Domain
Mol. Mass.:25124.85
Organism:Homo sapiens (Human)
Description:Q99720
Residue:223
BDBM50336843
NameBDBM50336843
Synonyms:3-((2-Fluorothiazol-4-yl)ethynyl)-5-fluorobenzonitrile | CHEMBL1672288
TypeSmall organic molecule
Emp. Form.C12H4F2N2S
Mol. Mass.246.235
SMILESFc1nc(cs1)C#Cc1cc(F)cc(c1)C#N