Reaction Details
TargetD(2) dopamine receptor
LigandBDBM50007422
Substrate/Competitorn/a
Meas. Tech.ChEMBL_718437 (CHEMBL1680101)
Ki 0.18±n/a nM
Citation Sromek, AWSi, YGZhang, TGeorge, SRSeeman, PNeumeyer, JL Synthesis and Biological Evaluation of N-Fluoroalkyl and 2-Fluoroalkoxy Substituted Aporphines: Potential PET Ligands for Dopamine D(2) Receptors. ACS Med Chem Lett2:189-194 (2011) 
 
D(2) dopamine receptor
Name:D(2) dopamine receptor
Type:G Protein-Coupled Receptor (GPCR)
Mol. Mass.:50931.60
Organism:Rattus norvegicus (rat)
Description:P61169
Residue:444
BDBM50007422
NameBDBM50007422
Synonyms:(+)-6-Propyl-5,6,6a,7-tetrahydro-4H-dibenzo[de,g]quinoline-10,11-diol (R) 6-Propyl-5,6,6a,7-tetrahydro-4H-dibenzo[de,g]quinoline-10,11-diol (R)-6-propyl-5,6,6a,7-tetrahydro-4H-dibenzo[de,g]quinoline-10,11-diol 6-Propyl-5,6,6a,7-tetrahydro-4H-dibenzo[de,g]quinoline-10,11-diol CHEMBL538542 N-propylnorapomorphine-(+) | N-propylnorapomorphine-(-)
TypeSmall organic molecule
Emp. Form.C19H21NO2
Mol. Mass.295.3755
SMILESCCCN1CCc2cccc-3c2[C@H]1Cc1ccc(O)c(O)c-31