Reaction Details
TargetHistone deacetylase 2
LigandBDBM26109
Substrate/Competitorn/a
Meas. Tech.ChEMBL_718469 (CHEMBL1680133)
IC50 12000±n/a nM
Citation Fass, DMShah, RGhosh, BHennig, KNorton, SZhao, WNReis, SAKlein, PSMazitschek, RMaglathlin, RLLewis, TAHaggarty, SJ Effect of Inhibiting Histone Deacetylase with Short-Chain Carboxylic Acids and Their Hydroxamic Acid Analogs on Vertebrate Development and Neuronal Chromatin. ACS Med Chem Lett2:39-42 (2011) 
 
Histone deacetylase 2
Name:Histone deacetylase 2
Type:Chromatin regulator; hydrolase; repressor
Mol. Mass.:55356.54
Organism:Homo sapiens (Human)
Description:Q92769
Residue:488
BDBM26109
NameBDBM26109
Synonyms:Butyrate butanoic acid, 4
TypeSmall organic molecule
Emp. Form.C4H8O2
Mol. Mass.88.1051
SMILESCCCC(O)=O