Reaction Details
TargetHistone deacetylase 2
LigandBDBM50336883
Substrate/Competitorn/a
Meas. Tech.ChEMBL_718469 (CHEMBL1680133)
IC50 9000±n/a nM
Citation Fass, DMShah, RGhosh, BHennig, KNorton, SZhao, WNReis, SAKlein, PSMazitschek, RMaglathlin, RLLewis, TAHaggarty, SJ Effect of Inhibiting Histone Deacetylase with Short-Chain Carboxylic Acids and Their Hydroxamic Acid Analogs on Vertebrate Development and Neuronal Chromatin. ACS Med Chem Lett2:39-42 (2011) 
 
Histone deacetylase 2
Name:Histone deacetylase 2
Type:Chromatin regulator; hydrolase; repressor
Mol. Mass.:55356.54
Organism:Homo sapiens (Human)
Description:Q92769
Residue:488
BDBM50336883
NameBDBM50336883
Synonyms:Butyrylhydroxamic acid | CHEMBL1672332
TypeSmall organic molecule
Emp. Form.C4H9NO2
Mol. Mass.103.1198
SMILESCCCC(=O)NO