Reaction Details
TargetHistone deacetylase 8
LigandBDBM50336883
Substrate/Competitorn/a
Meas. Tech.ChEMBL_718471 (CHEMBL1680135)
IC50 26000±n/a nM
Citation Fass, DMShah, RGhosh, BHennig, KNorton, SZhao, WNReis, SAKlein, PSMazitschek, RMaglathlin, RLLewis, TAHaggarty, SJ Effect of Inhibiting Histone Deacetylase with Short-Chain Carboxylic Acids and Their Hydroxamic Acid Analogs on Vertebrate Development and Neuronal Chromatin. ACS Med Chem Lett2:39-42 (2011) 
 
Histone deacetylase 8
Name:Histone deacetylase 8
Type:Enzyme
Mol. Mass.:41749.60
Organism:Homo sapiens (Human)
Description:Q9BY41
Residue:377
BDBM50336883
NameBDBM50336883
Synonyms:Butyrylhydroxamic acid | CHEMBL1672332
TypeSmall organic molecule
Emp. Form.C4H9NO2
Mol. Mass.103.1198
SMILESCCCC(=O)NO