Reaction Details
TargetHistone deacetylase 7
LigandBDBM36184
Substrate/Competitorn/a
Meas. Tech.ChEMBL_718474 (CHEMBL1680138)
IC50>2000000±n/a nM
Citation Fass, DMShah, RGhosh, BHennig, KNorton, SZhao, WNReis, SAKlein, PSMazitschek, RMaglathlin, RLLewis, TAHaggarty, SJ Effect of Inhibiting Histone Deacetylase with Short-Chain Carboxylic Acids and Their Hydroxamic Acid Analogs on Vertebrate Development and Neuronal Chromatin. ACS Med Chem Lett2:39-42 (2011) 
 
Histone deacetylase 7
Name:Histone deacetylase 7
Type:Chromatin regulator; hydrolase; repressor
Mol. Mass.:102942.62
Organism:Homo sapiens (Human)
Description:Q8WUI4
Residue:952
BDBM36184
NameBDBM36184
Synonyms:4-phenylbutanoate
TypeGuest
Emp. Form.C10H11O2
Mol. Mass.163.1937
SMILES[O-]C(=O)CCCc1ccccc1