Reaction Details
TargetHistone deacetylase 9
LigandBDBM36184
Substrate/Competitorn/a
Meas. Tech.ChEMBL_718475 (CHEMBL1680139)
IC50>2000000±n/a nM
Citation Fass, DMShah, RGhosh, BHennig, KNorton, SZhao, WNReis, SAKlein, PSMazitschek, RMaglathlin, RLLewis, TAHaggarty, SJ Effect of Inhibiting Histone Deacetylase with Short-Chain Carboxylic Acids and Their Hydroxamic Acid Analogs on Vertebrate Development and Neuronal Chromatin. ACS Med Chem Lett2:39-42 (2011) 
 
Histone deacetylase 9
Name:Histone deacetylase 9
Type:Enzyme
Mol. Mass.:111304.31
Organism:Homo sapiens (Human)
Description:Q9UKV0
Residue:1011
BDBM36184
NameBDBM36184
Synonyms:4-phenylbutanoate
TypeGuest
Emp. Form.C10H11O2
Mol. Mass.163.1937
SMILES[O-]C(=O)CCCc1ccccc1