Reaction Details
TargetHistone deacetylase 1
LigandBDBM50015142
Substrate/Competitorn/a
Meas. Tech.ChEMBL_718468 (CHEMBL1680132)
IC50 600±n/a nM
Citation Fass, DMShah, RGhosh, BHennig, KNorton, SZhao, WNReis, SAKlein, PSMazitschek, RMaglathlin, RLLewis, TAHaggarty, SJ Effect of Inhibiting Histone Deacetylase with Short-Chain Carboxylic Acids and Their Hydroxamic Acid Analogs on Vertebrate Development and Neuronal Chromatin. ACS Med Chem Lett2:39-42 (2011) 
 
Histone deacetylase 1
Name:Histone deacetylase 1
Type:Enzyme
Mol. Mass.:55090.27
Organism:Homo sapiens (Human)
Description:Q13547
Residue:482
BDBM50015142
NameBDBM50015142
Synonyms:4-Phenylbutyrohydroxamic acid N-Hydroxy-4-phenyl-butyramide
TypeSmall organic molecule
Emp. Form.C10H13NO2
Mol. Mass.179.2157
SMILESONC(=O)CCCc1ccccc1