Reaction Details
TargetHistone deacetylase 7
LigandBDBM50015142
Substrate/Competitorn/a
Meas. Tech.ChEMBL_718474 (CHEMBL1680138)
IC50 150000±n/a nM
Citation Fass, DMShah, RGhosh, BHennig, KNorton, SZhao, WNReis, SAKlein, PSMazitschek, RMaglathlin, RLLewis, TAHaggarty, SJ Effect of Inhibiting Histone Deacetylase with Short-Chain Carboxylic Acids and Their Hydroxamic Acid Analogs on Vertebrate Development and Neuronal Chromatin. ACS Med Chem Lett2:39-42 (2011) 
 
Histone deacetylase 7
Name:Histone deacetylase 7
Type:Chromatin regulator; hydrolase; repressor
Mol. Mass.:102942.62
Organism:Homo sapiens (Human)
Description:Q8WUI4
Residue:952
BDBM50015142
NameBDBM50015142
Synonyms:4-Phenylbutyrohydroxamic acid N-Hydroxy-4-phenyl-butyramide
TypeSmall organic molecule
Emp. Form.C10H13NO2
Mol. Mass.179.2157
SMILESONC(=O)CCCc1ccccc1