Reaction Details
TargetHistone deacetylase 9
LigandBDBM50015142
Substrate/Competitorn/a
Meas. Tech.ChEMBL_718475 (CHEMBL1680139)
IC50 430000±n/a nM
Citation Fass, DMShah, RGhosh, BHennig, KNorton, SZhao, WNReis, SAKlein, PSMazitschek, RMaglathlin, RLLewis, TAHaggarty, SJ Effect of Inhibiting Histone Deacetylase with Short-Chain Carboxylic Acids and Their Hydroxamic Acid Analogs on Vertebrate Development and Neuronal Chromatin. ACS Med Chem Lett2:39-42 (2011) 
 
Histone deacetylase 9
Name:Histone deacetylase 9
Type:Enzyme
Mol. Mass.:111304.31
Organism:Homo sapiens (Human)
Description:Q9UKV0
Residue:1011
BDBM50015142
NameBDBM50015142
Synonyms:4-Phenylbutyrohydroxamic acid N-Hydroxy-4-phenyl-butyramide
TypeSmall organic molecule
Emp. Form.C10H13NO2
Mol. Mass.179.2157
SMILESONC(=O)CCCc1ccccc1