Reaction Details
TargetHistone deacetylase 3
LigandBDBM50336884
Substrate/Competitorn/a
Meas. Tech.ChEMBL_718470 (CHEMBL1680134)
IC50 340000±n/a nM
Citation Fass, DMShah, RGhosh, BHennig, KNorton, SZhao, WNReis, SAKlein, PSMazitschek, RMaglathlin, RLLewis, TAHaggarty, SJ Effect of Inhibiting Histone Deacetylase with Short-Chain Carboxylic Acids and Their Hydroxamic Acid Analogs on Vertebrate Development and Neuronal Chromatin. ACS Med Chem Lett2:39-42 (2011) 
 
Histone deacetylase 3
Name:Histone deacetylase 3
Type:Enzyme
Mol. Mass.:48829.55
Organism:Homo sapiens (Human)
Description:O15379
Residue:428
BDBM50336884
NameBDBM50336884
Synonyms:2-Propyl-pentanoic acid hydroxyamide Valpropylhydroxamic acid
TypeSmall organic molecule
Emp. Form.C8H17NO2
Mol. Mass.159.2261
SMILESCCCC(CCC)C(=O)NO