Reaction Details
TargetHistone deacetylase 7
LigandBDBM50336884
Substrate/Competitorn/a
Meas. Tech.ChEMBL_718474 (CHEMBL1680138)
IC50 99000±n/a nM
Citation Fass, DMShah, RGhosh, BHennig, KNorton, SZhao, WNReis, SAKlein, PSMazitschek, RMaglathlin, RLLewis, TAHaggarty, SJ Effect of Inhibiting Histone Deacetylase with Short-Chain Carboxylic Acids and Their Hydroxamic Acid Analogs on Vertebrate Development and Neuronal Chromatin. ACS Med Chem Lett2:39-42 (2011) 
 
Histone deacetylase 7
Name:Histone deacetylase 7
Type:Chromatin regulator; hydrolase; repressor
Mol. Mass.:102942.62
Organism:Homo sapiens (Human)
Description:Q8WUI4
Residue:952
BDBM50336884
NameBDBM50336884
Synonyms:2-Propyl-pentanoic acid hydroxyamide Valpropylhydroxamic acid
TypeSmall organic molecule
Emp. Form.C8H17NO2
Mol. Mass.159.2261
SMILESCCCC(CCC)C(=O)NO