Reaction Details
TargetHistone deacetylase 6
LigandBDBM50336884
Substrate/Competitorn/a
Meas. Tech.ChEMBL_718476 (CHEMBL1680140)
IC50 16000±n/a nM
Citation Fass, DMShah, RGhosh, BHennig, KNorton, SZhao, WNReis, SAKlein, PSMazitschek, RMaglathlin, RLLewis, TAHaggarty, SJ Effect of Inhibiting Histone Deacetylase with Short-Chain Carboxylic Acids and Their Hydroxamic Acid Analogs on Vertebrate Development and Neuronal Chromatin. ACS Med Chem Lett2:39-42 (2011) 
 
Histone deacetylase 6
Name:Histone deacetylase 6
Type:Chromatin regulator; hydrolase; repressor
Mol. Mass.:131381.51
Organism:Homo sapiens (Human)
Description:Q9UBN7
Residue:1215
BDBM50336884
NameBDBM50336884
Synonyms:2-Propyl-pentanoic acid hydroxyamide Valpropylhydroxamic acid
TypeSmall organic molecule
Emp. Form.C8H17NO2
Mol. Mass.159.2261
SMILESCCCC(CCC)C(=O)NO