Reaction Details
TargetNeuropeptide FF receptor 1
LigandBDBM26349
Substrate/Competitorn/a
Meas. Tech.ChEMBL_718923 (CHEMBL1681417)
IC50 4.7±n/a nM
Citation Oishi, SMisu, RTomita, KSetsuda, SMasuda, ROhno, HNaniwa, YIeda, NInoue, NOhkura, SUenoyama, YTsukamura, HMaeda, KHirasawa, ATsujimoto, GFujii, N Activation of Neuropeptide FF Receptors by Kisspeptin Receptor Ligands. ACS Med Chem Lett2:53-57 (2011) 
 
Neuropeptide FF receptor 1
Name:Neuropeptide FF receptor 1
Type:PROTEIN
Mol. Mass.:47840.07
Organism:Homo sapiens (Human)
Description:ChEMBL_1474637
Residue:430
BDBM26349
NameBDBM26349
Synonyms:(2S)-2-[(2S)-2-[(2S)-2-[(2S)-2-amino-3-(4-hydroxyphenyl)propanamido]butanediamido]-3-(1H-indol-3-yl)propanamido]-N-[(1S)-1-{[(1S)-1-[({[(1S)-1-{[(1S)-4-carbamimidamido-1-{[(1S)-1-carbamoyl-2-phenylethyl]carbamoyl}butyl]carbamoyl}-3-methylbutyl]carbamoyl}methyl)carbamoyl]-2-phenylethyl]carbamoyl}-2-hydroxyethyl]butanediamide Kisspeptin-10
Type10-mer
Emp. Form.C63H83N17O14
Mol. Mass.1302.4386
SMILESCC(C)C[C@H](NC(=O)CNC(=O)[C@H](Cc1ccccc1)NC(=O)[C@H](CO)NC(=O)[C@H](CC(N)=O)NC(=O)[C@H](Cc1c[nH]c2ccccc12)NC(=O)[C@H](CC(N)=O)NC(=O)[C@@H](N)Cc1ccc(O)cc1)C(=O)N[C@@H](CCCN=C(N)N)C(=O)N[C@@H](Cc1ccccc1)C(N)=O