Reaction Details
TargetMitogen-activated protein kinase 7
LigandBDBM50337145
Substrate/Competitorn/a
Meas. Tech.ChEMBL_719091 (CHEMBL1679302)
IC50 11380±n/a nM
Citation Deng, XYang, QKwiatkowski, NSim, TMcDermott, USettleman, JELee, JDGray, NS Discovery of a benzo[e]pyrimido-[5,4-b][1,4]diazepin-6(11H)-one as a Potent and Selective Inhibitor of Big MAP Kinase 1. ACS Med Chem Lett2:195-200 (2011) 
 
Mitogen-activated protein kinase 7
Name:Mitogen-activated protein kinase 7
Type:Protein
Mol. Mass.:88377.36
Organism:Homo sapiens (Human)
Description:Q13164
Residue:816
BDBM50337145
NameBDBM50337145
Synonyms:9-chloro-2-((2-methoxy-4-(4-methylpiperazin-1-yl)phenyl)amino)-5,11-dimethyl-5H-benzo[e]pyrimido[5,4-b][1,4]diazepin-6(11H)-one | CHEMBL1673057
TypeSmall organic molecule
Emp. Form.C25H28ClN7O2
Mol. Mass.493.989
SMILESCOc1cc(ccc1Nc1ncc2N(C)C(=O)c3ccc(Cl)cc3N(C)c2n1)N1CCN(C)CC1