Reaction Details
TargetSteroid 17-alpha-hydroxylase/17,20 lyase
LigandBDBM50338353
Substrate/Competitorn/a
Meas. Tech.ChEMBL_728149 (CHEMBL1687150)
IC50 12±n/a nM
Citation Kaku, TMatsunaga, NOjida, ATanaka, THara, TYamaoka, MKusaka, MTasaka, A 17,20-lyase inhibitors. Part 4: design, synthesis and structure-activity relationships of naphthylmethylimidazole derivatives as novel 17,20-lyase inhibitors. Bioorg Med Chem19:1751-70 (2011) 
 
Steroid 17-alpha-hydroxylase/17,20 lyase
Name:Steroid 17-alpha-hydroxylase/17,20 lyase
Type:Enzyme
Mol. Mass.:57255.68
Organism:Rattus norvegicus (Rat)
Description:P11715
Residue:507
BDBM50338353
NameBDBM50338353
Synonyms:CHEMBL1682899 | rac-6-[1-Hydroxy-1-(1H-imidazol-4-yl)-2-methylpropyl]-N,3-dimethyl-2-naphthamide
TypeSmall organic molecule
Emp. Form.C20H23N3O2
Mol. Mass.337.4155
SMILESCNC(=O)c1cc2ccc(cc2cc1C)C(O)(C(C)C)c1cnc[nH]1