Reaction Details
TargetSteroid 17-alpha-hydroxylase/17,20 lyase
LigandBDBM50338357
Substrate/Competitorn/a
Meas. Tech.ChEMBL_728150 (CHEMBL1687151)
IC50 19±n/a nM
Citation Kaku, TMatsunaga, NOjida, ATanaka, THara, TYamaoka, MKusaka, MTasaka, A 17,20-lyase inhibitors. Part 4: design, synthesis and structure-activity relationships of naphthylmethylimidazole derivatives as novel 17,20-lyase inhibitors. Bioorg Med Chem19:1751-70 (2011) 
 
Steroid 17-alpha-hydroxylase/17,20 lyase
Name:Steroid 17-alpha-hydroxylase/17,20 lyase
Type:Enzyme
Mol. Mass.:57382.42
Organism:Homo sapiens (Human)
Description:E.coli expressing human CYP17
Residue:508
BDBM50338357
NameBDBM50338357
Synonyms:CHEMBL1682903 | rac-6-[1-Hydroxy-1-(1H-imidazol-4-yl)-2-methylpropyl]-2-methyl-2,3-dihydro-1H-benzo[f]isoindol-1-one
TypeSmall organic molecule
Emp. Form.C20H21N3O2
Mol. Mass.335.3996
SMILESCC(C)C(O)(c1cnc[nH]1)c1ccc2cc3C(=O)N(C)Cc3cc2c1