Reaction Details
TargetCaspase-3
LigandBDBM50338491
Substrate/Competitorn/a
Meas. Tech.ChEMBL_728313 (CHEMBL1687573)
Ki 14.5±n/a nM
Citation Jiang, YHansen, TV Isatin 1,2,3-triazoles as potent inhibitors against caspase-3. Bioorg Med Chem Lett21:1626-9 (2011) 
 
Caspase-3
Name:Caspase-3
Type:Hydrolase; heterotetramer of two heterodimers
Mol. Mass.:31607.55
Organism:Homo sapiens (Human)
Description:n/a
Residue:277
BDBM50338491
NameBDBM50338491
Synonyms:(S)-1-((1-(2,3-dihydrobenzo[b][1,4]dioxin-6-yl)-1H-1,2,3-triazol-4-yl)methyl)-5-(2-(methoxymethyl)pyrrolidin-1-ylsulfonyl)indoline-2,3-dione | CHEMBL1683178
TypeSmall organic molecule
Emp. Form.C25H25N5O7S
Mol. Mass.539.56
SMILESCOC[C@@H]1CCCN1S(=O)(=O)c1ccc2N(Cc3cn(nn3)-c3ccc4OCCOc4c3)C(=O)C(=O)c2c1