Reaction Details
TargetSucrase-isomaltase, intestinal
LigandBDBM50263044
Substrate/Competitorn/a
Meas. Tech.ChEMBL_726860 (CHEMBL1686566)
IC50 200±n/a nM
Citation Xie, WTanabe, GAkaki, JMorikawa, TNinomiya, KMinematsu, TYoshikawa, MWu, XMuraoka, O Isolation, structure identification and SAR studies on thiosugar sulfonium salts, neosalaprinol and neoponkoranol, as potenta-glucosidase inhibitors. Bioorg Med Chem19:2015-22 (2011) 
 
Sucrase-isomaltase, intestinal
Name:Sucrase-isomaltase, intestinal
Type:Enzyme
Mol. Mass.:210329.04
Organism:Rattus norvegicus (Rat)
Description:P23739
Residue:1841
BDBM50263044
NameBDBM50263044
Synonyms:CHEMBL476960 | Voglibose
TypeSmall organic molecule
Emp. Form.C10H21NO7
Mol. Mass.267.2762
SMILESOCC(CO)N[C@H]1C[C@](O)(CO)[C@@H](O)[C@H](O)[C@H]1O