Reaction Details
TargetSucrase-isomaltase, intestinal
LigandBDBM50338669
Substrate/Competitorn/a
Meas. Tech.ChEMBL_726861 (CHEMBL1686567)
IC50 300±n/a nM
Citation Xie, WTanabe, GAkaki, JMorikawa, TNinomiya, KMinematsu, TYoshikawa, MWu, XMuraoka, O Isolation, structure identification and SAR studies on thiosugar sulfonium salts, neosalaprinol and neoponkoranol, as potenta-glucosidase inhibitors. Bioorg Med Chem19:2015-22 (2011) 
 
Sucrase-isomaltase, intestinal
Name:Sucrase-isomaltase, intestinal
Type:Enzyme
Mol. Mass.:210329.04
Organism:Rattus norvegicus (Rat)
Description:P23739
Residue:1841
BDBM50338669
NameBDBM50338669
Synonyms:CHEMBL1684162 | Neosalacinol
TypeSmall organic molecule
Emp. Form.C9H18O6S
Mol. Mass.254.301
SMILESOC[C@H]([O-])[C@H](O)C[S@@+]1C[C@@H](O)[C@H](O)[C@H]1CO