Reaction Details
TargetRAF proto-oncogene serine/threonine-protein kinase
LigandBDBM50338875
Substrate/Competitorn/a
Meas. Tech.ChEMBL_727230 (CHEMBL1687324)
IC50 240.3±n/a nM
Citation Kim, MHKim, MYu, HKim, HYoo, KHSim, THah, JM Structure based design and syntheses of amino-1H-pyrazole amide derivatives as selective Raf kinase inhibitors in melanoma cells. Bioorg Med Chem19:1915-23 (2011) 
 
RAF proto-oncogene serine/threonine-protein kinase
Name:RAF proto-oncogene serine/threonine-protein kinase
Type:Serine/threonine-protein kinase
Mol. Mass.:73082.52
Organism:Homo sapiens (Human)
Description:P04049
Residue:648
BDBM50338875
NameBDBM50338875
Synonyms:CHEMBL1684783 | N-(5-Amino-1-(4-methoxybenzyl)-1H-pyrazol-4-yl)-2-methyl-5-(3-(4-methylpiperazin-1-yl)-5-(trifluoromethyl)benzamido)benzamide
TypeSmall organic molecule
Emp. Form.C32H34F3N7O3
Mol. Mass.621.6527
SMILESCOc1ccc(Cn2ncc(NC(=O)c3cc(NC(=O)c4cc(cc(c4)C(F)(F)F)N4CCN(C)CC4)ccc3C)c2N)cc1