Reaction Details
TargetAdenosine receptor A3
LigandBDBM50339076
Substrate/Competitorn/a
Meas. Tech.ChEMBL_730137 (CHEMBL1696017)
Ki 11.8±n/a nM
Citation Hou, XKim, HOAlexander, VKim, KChoi, SPark, SGLee, JHYoo, LSGao, ZGJacobson, KAJeong, LS Discovery of New Human A(2A) Adenosine Receptor Agonists: Design, Synthesis, and Binding Mode of Truncated 2-Hexynyl-4'-thioadenosine. ACS Med Chem Lett9:516-520 (2010) 
 
Adenosine receptor A3
Name:Adenosine receptor A3
Type:G Protein-Coupled Receptor (GPCR)
Mol. Mass.:36197.32
Organism:Homo sapiens (Human)
Description:P0DMS8
Residue:318
BDBM50339076
NameBDBM50339076
Synonyms:(2R,3R,4S)-2-(6-amino-2-(hex-1-ynyl)-9H-purin-9-yl)tetrahydrothiophene-3,4-diol | CHEMBL1688378
TypeSmall organic molecule
Emp. Form.C15H19N5O2S
Mol. Mass.333.409
SMILESCCCCC#Cc1nc(N)c2ncn([C@@H]3SC[C@@H](O)[C@H]3O)c2n1