Reaction Details
TargetPleiotropic ABC efflux transporter of multiple drugs
LigandBDBM50002338
Substrate/Competitorn/a
Meas. Tech.ChEMBL_730212 (CHEMBL1696307)
IC50 1300±n/a nM
Citation Kolaczkowski, MKolaczkowska, AMotohashi, NMichalak, K New high-throughput screening assay to reveal similarities and differences in inhibitory sensitivities of multidrug ATP-binding cassette transporters. Antimicrob Agents Chemother53:1516-27 (2009) 
 
Pleiotropic ABC efflux transporter of multiple drugs
Name:Pleiotropic ABC efflux transporter of multiple drugs
Type:PROTEIN
Mol. Mass.:170453.87
Organism:Saccharomyces cerevisiae S288c
Description:ChEMBL_730212
Residue:1511
BDBM50002338
NameBDBM50002338
Synonyms:(Thioridazine)10-[2-(1-Methyl-piperidin-2-yl)-ethyl]-2-methylsulfanyl-10H-phenothiazine 10-[2-(1-Methyl-piperidin-2-yl)-ethyl]-2-methylsulfanyl-10H-phenothiazine CHEMBL479 MELLARIL-S TP-21 | US9504692, Thioridazine
TypeSmall organic molecule
Emp. Form.C21H26N2S2
Mol. Mass.370.575
SMILESCSc1ccc2Sc3ccccc3N(CCC3CCCCN3C)c2c1